{"text_format":"1","workbook":"xlsx","n_sheets":3,"sheets":["DOORLIST","EXTRAS","CALCULATIONS"],"not_rendered":{"charts":0,"images":47,"macros":1,"external_links":0,"defined_names":41,"comments":1,"pivot_tables":0},"unopened":[],"bounds":{"document_bytes":16777216,"sheet_cells":100000,"rows_first":2000,"rows_last":500,"rows_between":2000,"halvings":0,"cell_chars":16384,"cell_head_chars":4096},"cells_cut":0,"cells_raw":0,"read":"whole","date_system":"1900"}

{"sheet":"DOORLIST","index":0,"n_rows":170,"n_cols":50,"rows_kept":170,"cut":false,"hidden":false,"merged":[[17,1,18,1],[17,7,18,7],[17,40,18,40],[17,17,17,21],[17,2,18,2],[17,3,18,3],[8,1,13,1],[11,4,11,5],[12,4,12,5],[13,4,13,5],[14,4,14,5],[15,4,15,5],[17,22,17,23],[17,12,18,12],[17,8,17,11],[4,16,15,16],[8,4,8,5],[9,4,9,5],[10,4,10,5],[17,4,18,4],[17,5,18,5],[17,6,18,6],[4,48,14,48],[17,48,18,48],[5,10,5,11],[4,10,4,11],[17,41,18,41],[17,13,17,15],[17,46,18,46],[17,45,18,45],[17,44,18,44],[17,33,17,34],[17,24,17,27],[17,28,17,30],[6,8,6,12],[7,8,14,15],[3,4,3,5],[4,4,4,5],[6,4,6,5],[7,4,7,5],[5,4,5,5]]}
[]
[null,"LETHE CUSTOMER DOORLIST",null,null,null,null,null,null,null,null,null,null,null,null,null,null,null,null,null,null,null,null,null,null,null,null,null,null,null,null,null,null,null,null,null,null,null,null,null,null,null,null,null,{"$f":"VERS","v":"Vers. 7.3 \"Marlene\" - 10.10.2023"}]
[]
[null,null,null,"Company:",null,null,null,null,"HELP",null,"(please select first the number of column & 2nd an option)"]
[null,null,null,"Order No.:",null,null,null,"1.","Column",null,null,null,null,null,null,null,null,null,null,null,null,null,null,null,null,null,null,null,null,null,null,null,null,null,null,null,null,null,null,null,null,null,null,null,null,null,null,null,"This column tagged automatically \nif any remark is doing on second sheet."]
[null,null,null,"Date:",null,null,null,"2.","Options"]
[null,null,null,"Project:",null,null,null,null,"Information (Text)"]
[null,null,null,"Yard:",null,null,null,null,{"$f":"IF(OR(CALCULATIONS!Z17=\"\",CALCULATIONS!Z17=0),\"\",CALCULATIONS!Z17)","v":""}]
[null,null,{"$f":"IF(OR(EXACT(D9,C21:C170)),\"x\",\"\")","v":""},"Rev 0",null,null,"< please fill Date"]
[null,null,{"$f":"IF(OR(EXACT(D10,C21:C170)),\"x\",\"\")","v":""},"Rev 1",null,null,"< please fill Date"]
[null,null,{"$f":"IF(OR(EXACT(D11,C21:C170)),\"x\",\"\")","v":""},"Rev 2",null,null,"< please fill Date"]
[null,null,{"$f":"IF(OR(EXACT(D12,C21:C170)),\"x\",\"\")","v":""},"Rev 3",null,null,"< please fill Date"]
[null,null,{"$f":"IF(OR(EXACT(D13,C21:C170)),\"x\",\"\")","v":""},"Rev 4",null,null,"< please fill Date"]
[null,null,{"$f":"IF(OR(EXACT(D14,C21:C170)),\"x\",\"\")","v":""},"Rev 5",null,null,"< please fill Date"]
[]
[null,null,null,null,{"$f":"VERS","v":"Vers. 7.3 \"Marlene\" - 10.10.2023"},null,null,null,null,null,null,null,null,null,null,null,null,null,null,null,null,null,null,null,null,null,null,null,null,null,null,null,null,null,null,null,null,null,null,null,null,null,null,null,null,null,null,null,"<="]
[null,{"$f":"COLUMN()-1","v":1},{"$f":"COLUMN()-1","v":2},{"$f":"COLUMN()-1","v":3},4,5,6,7,8,9,10,11,12,13,14,15,16,17,18,19,20,21,22,23,24,25,26,27,28,29,30,31,32,33,34,35,36,37,38,39,40,41,42,43,44,45,{"$f":"COLUMN()-1","v":46},null,{"$f":"COLUMN()-1","v":48}]
[{"$f":"LARGE($A21:$A170,1)","v":0},"SEQ.\nNO.","REV.\nNO.","DOOR\nNO.","DESIGN.\nPOSITION I","DESIGN.\nPOSITION II","DOOR\nTYPE","FIRE\nRATING","BASIC DIMENSION",null,null,null,"HINGE\nSIDE","INST. FRAME",null,null,"SILL","DOOR FRAME",null,null,null,null,"LEAF SURFACE DESIGN",null,"LEAF EDGING",null,null,null,"HINGE",null,null,"SEAL.","DOOR","LOCK",null,"HANDLE","HOLE F.","CONTACT","SURF.","NOISE","WINDOW\nDIM","WINDOW\nHEIGHT","HP","REMARK (short version)","DATE OF PLANNED\nAPPROVAL","DATE OF 1st\nAPPROVAL","RESPONS-\nIBILITY",null,"REM. ?"]
[null,null,null,null,null,null,null,null,"CO\n(min 550)","CH\n(min 1200)","HH","SD",null,"MAT","SURF.","DIM.\nB / L / R / T - DEPTH\nor simple as STD","TYPE","GL","TYPE","MAT","HS","RS","HS","RS","TYPE","SURF","VER","DIM","TYPE","E","DIST.\n(Below 250!)","COLOUR","CLOSER","TYPE","BS","TYPE","PZ/WC ?","SWITCH","HINGES","GASKET",null,null,null,"(for additional remakrs pls. refer also to worksheet \"CUSTOMER_EXTRAS\")"]
[]
{"$rows_left_out":151}
{"sheet":"EXTRAS","index":1,"n_rows":170,"n_cols":18,"rows_kept":170,"cut":false,"hidden":false,"merged":[[14,5,14,16],[7,3,7,4],[8,3,8,4],[9,3,9,4],[10,3,10,4],[11,3,11,4],[12,3,12,4],[13,3,13,4],[14,3,14,4],[17,2,18,2],[3,3,3,4],[4,3,4,4],[5,3,5,4],[6,3,6,4]]}
[]
[null,"LETHE CUSTOMER DOORLIST // EXTRAS",null,null,null,null,null,null,null,null,null,null,null,null,null,null,{"$f":"VERS","v":"Vers. 7.3 \"Marlene\" - 10.10.2023"}]
[]
[null,null,"Company:",{"$f":"IF(DOORLIST!E4=\"\",\"\",DOORLIST!E4)","v":""}]
[null,null,"Order No.:",{"$f":"IF(DOORLIST!E5=\"\",\"\",DOORLIST!E5)","v":""}]
[null,null,"Date:",{"$f":"IF(DOORLIST!E6=\"\",\"\",DOORLIST!E6)","v":""}]
[null,null,"Project:",{"$f":"IF(DOORLIST!E7=\"\",\"\",DOORLIST!E7)","v":""}]
[null,null,"Yard:",{"$f":"IF(DOORLIST!E8=\"\",\"\",DOORLIST!E8)","v":""}]
[null,null,{"$f":"IF(DOORLIST!D9=\"\",\"\",DOORLIST!D9)","v":"Rev 0"},{"$f":"IF(DOORLIST!E9=\"\",\"\",DOORLIST!E9)","v":""}]
[null,null,{"$f":"IF(DOORLIST!D10=\"\",\"\",DOORLIST!D10)","v":"Rev 1"},{"$f":"IF(DOORLIST!E10=\"\",\"\",DOORLIST!E10)","v":""}]
[null,null,{"$f":"IF(DOORLIST!D11=\"\",\"\",DOORLIST!D11)","v":"Rev 2"},{"$f":"IF(DOORLIST!E11=\"\",\"\",DOORLIST!E11)","v":""}]
[null,null,{"$f":"IF(DOORLIST!D12=\"\",\"\",DOORLIST!D12)","v":"Rev 3"},{"$f":"IF(DOORLIST!E12=\"\",\"\",DOORLIST!E12)","v":""}]
[null,null,{"$f":"IF(DOORLIST!D13=\"\",\"\",DOORLIST!D13)","v":"Rev 4"},{"$f":"IF(DOORLIST!E13=\"\",\"\",DOORLIST!E13)","v":""}]
[null,null,{"$f":"IF(DOORLIST!D14=\"\",\"\",DOORLIST!D14)","v":"Rev 5"},{"$f":"IF(DOORLIST!E14=\"\",\"\",DOORLIST!E14)","v":""}]
[null,null,null,{"$f":"IF(DOORLIST!E15=\"\",\"\",DOORLIST!E15)","v":""},null,"PLEASE USE THE FREE COLUMNS TO ADD ADDITIONAL REMARKS OR EXTRAS"]
[]
[null,{"$f":"COLUMN()-1","v":1},{"$f":"COLUMN()-1","v":2},3,4,5,6,7,8,9,10,11,12,13,14,15,16]
[null,"SEQ.","REV.\nNO.","DOOR"]
[null,"NO.",null,"NO."]
[]
{"$rows_left_out":151}
{"sheet":"CALCULATIONS","index":2,"n_rows":141,"n_cols":42,"rows_kept":141,"cut":false,"hidden":true,"merged":[[0,33,0,41],[3,2,3,3],[1,2,1,3],[0,27,0,30],[16,27,17,27]]}
[null,null,"Version",null,null,null,null,"REVISIONS - HISTORY:",null,null,null,null,null,null,null,null,null,null,null,null,null,null,null,null,null,null,null,"statische Vorgaben (max. mögl. Auswahl)",null,null,null,null,"dyn. Berechn.","mögl. Auswahl der Optionen anhand des (unteren) gewählten Türtyps"]
[null,null,"Vers. 7.3 \"Marlene\" - 10.10.2023",null,null,null,null,"4.00 - Übernahme v. AKR",null,null,null,"5.5 - Komfortverbesserungen",null,null,null,null,null,null,null,null,null,null,null,null,null,null,null,"Türtypen","Scharniere","Schließer","Anz. Bänder",null,"Akt. Typ","LL-D3-A60","LL-D4-A60","LL-DL1-A60","LL-DL2-A60","LYD-3plus-A60","LM50-D2-B15","LM50-D4-B15","LYD-3plus-B15"]
[null,null,null,null,null,null,null,"4.1 - bessere Kennz. von Floor bei B",null,null,null,"5.6 - Berechnung der Bandanzahl hinzugefügt",null,null,null,null,null,null,null,null,null,null,null,null,null,null,null,"LL-D4-A60","VX7748/100","ITS96",2,null,{"$f":"ROW(a)+0*NOW()","v":4},"A0","A0","A0","A0","A0","B0","B0","B0","NO"]
[null,null,"abbreviation",null,null,null,null,"4.2 - VN-Bänder erlaubt bei LYD-A60",null,null,null,"5.7 - Neudefinition WANN 4th Band",null,null,null,null,null,null,null,null,null,null,null,null,null,null,null,"LYD-3plus-A60","VX7729/100","ITS96 w. EMF",3,null,{"$f":"IF(ISERROR(MATCH(INDIRECT(\"DOORLIST!$G\"&AG3),AH2:AP2,0))=TRUE,8,MATCH(INDIRECT(\"DOORLIST!$G\"&AG3),AH2:AP2,0))","v":8},"A30","A30","A30","A30","A30","B15","B15","B15"]
[null,null,"ST","Steel",null,null,null,"       - Schlauchkl. erlaubt bei LYD-A60",null,null,null,"5.7 - Fehlerkorrektur Fensterhöhe (wg. 2-flg.)",null,null,null,null,null,null,null,null,null,null,null,null,null,"Spalte",null,"LL-DL1-A60","TE526","TS93 on HS",4,null,null,"A60","A60","A60","A60","A60"]
[null,null,"SS","Stainless Steel",null,null,null,"4.3 - kl. Optimierungen u. Fehlerbereinigungen",null,null,null,"5.8 - neu definierte Bandabstände hinzugefügt",null,null,null,null,null,null,null,null,null,null,null,null,null,{"$f":"IF(DOORLIST!K5=\"\",\"\",DOORLIST!K5)","v":""},null,"LL-DL2-A60","TE626 A8","TS93 on RS",null,null,null,"A","A","A","A","A","STD","STD","STD"]
[null,null,"HS","Hinge Side",null,null,null,"       - dyn. Bandauswahl hinzugefügt",null,null,null,"5.9 - Fehler in Formel f. Bandabstände korrigiert",null,null,null,null,null,null,null,null,null,null,null,null,null,"Optionen",null,"LM50-D2-B15",null,"ED100 on HS",null,null,null,"B","B","B","B","B","FLO","FLO","FLO"]
[null,null,"RS","Rear Side",null,null,null,"       - Fenster bei LM50-D3-B15 n. möglich!",null,null,null,"6.0 - mit Bandabstand (unten) von 250 für Tectus und auch für VX. Sowie Umstellung auf VX implementiert.",null,null,null,null,null,null,null,null,null,null,null,null,null,{"$f":"IF(AA8<>\"\",INDEX(T:T,AA8),\"\")","v":""},{"$f":"IF(COUNTIF(Y:Y,\">=\"&$Z$6)>=ROW()-7,MATCH(LARGE(Y:Y,COUNTIF(Y:Y,\">=\"&$Z$6)-ROW()+8),Y:Y,0),\"\")","v":""},"LM50-D4-B15",null,"ED100 on RS",null,null,null,"C","C","C","C","C"]
[null,null,"BR","Brushed",null,null,null,"4.4 - Hinweis auf die Bandverlängerung überarbeitet, speziell WAS die 12mm sind.",null,null,null,"6.4 - größere Optimierungen w. Kopfzeile ein/ausblenden, div. Formatierungsoptimierungen etc.",null,null,null,null,null,null,null,null,null,null,null,null,null,"","","LYD-3plus-B15",null,null,null,null,null,"STD","STD","STD","STD","STD",1,1,1]
[null,null,"PO","Polished",null,null,null,"4.5 - Hinweis auf Zertifikatsbegrenzungen (bei CO+CH)",null,null,null,"6.5 - Hinweis auf unterem MR-Schenkel hinzugefügt (FAH)",null,null,null,null,null,null,null,null,null,null,null,null,null,"","","akt. Spalte:",{"$f":"COLUMN(a)+0*NOW()","v":5},null,null,null,null,null,null,null,null,null,2,2,2]
[null,null,"S","Straight",null,null,null,"5.0 - komplette Neubearbeitung",null,null,null,"6.6 - Fehler bei Auswahl B-Tür m. A-Klasse behoben und LM50-D3 entfernt",null,null,null,null,null,null,null,null,null,null,null,null,null,"","","akt. Zeile:",{"$f":"ROW(a)+0*NOW()","v":4},null,null,null,null,null,null,null,null,null,3,3,3]
[null,null,"F","Folded",null,null,null,null,null,null,null,null,null,null,null,null,null,null,null,null,null,null,null,null,null,"","","aktuelles CO:",{"$f":"INDIRECT(\"DOORLIST!I\" & akt_Zeile)","v":"HELP"},"akt. Türentyp:",{"$f":"INDIRECT(\"DOORLIST!G\" & akt_Zeile)","v":0},null,null,null,null,null,null,null,4,4,4]
[null,null,"PR","Primer",null,null,null,null,null,null,null,null,null,null,null,null,null,null,null,null,null,null,null,null,null,"","","aktuelles CH:",{"$f":"INDIRECT(\"DOORLIST!J\" & akt_Zeile)","v":0},"Typ = korrekt?",{"$f":"IF(OR(AE12=\"LL-D3-A60\",AE12=\"LL-D4-A60\",AE12=\"LL-DL1-A60\",AE12=\"LL-DL2-A60\",AE12=\"LYD-3plus-A60\",AE12=\"LM50-D2-B15\",AE12=\"LM50-D4-B15\",AE12=\"LYD-3plus-B15\"),\"Ja\",\"No\")","v":"No"},null,null,null,null,null,null,null,5,5,5]
[null,null,null,null,null,null,null,null,null,null,null,null,null,null,null,null,null,null,null,null,null,null,null,null,null,"",""]
[null,null,null,null,null,null,1,"sequential number",12,"hinge side (L)eft / (R)ight",null,"for A and B class doors available)",26,"style of frame:",36,"hole f. PZ/WC:",43,"remark (in short form)",null,null,null,null,null,null,null,{"$f":"IF(COUNTIF(Y:Y,\">=\"&$Z$6)>=ROW()-8,\"…\",\"\")","v":""},null,"akt. Flügelanzahl:",{"$f":"IF(AE13=\"No\",\"\",IF(AG4=3,2,1))","v":""},"akt. Schw.typ:",{"$f":"INDIRECT(\"DOORLIST!Q\" & akt_Zeile)","v":0},null,null,"VX7729/100","VX7729/100","VX7729/100","VX7729/100","VX7729/100","VX7729/100","VX7729/100","VX7729/100"]
[null,"Hilfszelle:",true,"f. Ein/Ausblenden jede 2. Zeile",null,null,2,"revision number",13,"material of installation frame",19,"material of door frame:",null,"(S)traight or (F)oldover (HS/RS)",null,"(Y)es or (N)o on HS/RS",44,"date of planned approval",null,null,null,null,null,null,null,"Info Text",null,"akt. Fenster:",{"$f":"INDIRECT(\"DOORLIST!AO\" & akt_Zeile)","v":0},null,null,null,null,"VX7748/100","VX7748/100","VX7748/100","VX7748/100","VX7748/100","VX7748/100","VX7748/100","VX7748/100"]
[null,null,null,"WAHR = Einblenden",null,null,3,"door number by customer",null,"(ST)eel or (S)tainless (S)teel",null,"(ST)eel or (S)tainless (S)teel",27,"dimension of frame angle (HS/RS)",37,"type of door contact",45,"date of 1st approval",null,null,null,null,null,null,null,{"$f":"IF(OR(ISERROR(VLOOKUP(DOORLIST!K6,Z8:AA14,2,FALSE))=TRUE,DOORLIST!K6=\"\"),Z18,INDEX(U:U,VLOOKUP(DOORLIST!K6,Z8:AA14,2,FALSE)))","v":0},null,"akt. FeHöhe: \n(=Auswahl)",{"$f":"IF(OR(ISNUMBER(AC16),ISNUMBER(FIND(\"x\",AC16))),IF(AG4=3,akt_CH-0.25*akt_CO,akt_CH-0.5*akt_CO),\"--\")","v":{"$error":"#VALUE!"}},null,null,null,null,null,"TE626 A8",null,"TE626 A8","TE526",null,"TE526","TE526"]
[null,null,null,"FALSCH = Ausblenden",null,null,4,"designation/position on board",14,"surface of installation frame",20,"frame surface on hinge side",28,"type of hinge",38,"hinges, striking plate, sill cover,",46,"responsibility",null,null,null,null,null,null,null,null,null,null,"it's allowed to overwrite automatical data/text ;)"]
[null,null,null,null,null,null,5,"designation/position on board",null,"ST:(PR)imer SS:(BR)ushed",21,"frame surface on reverse side",29,"\"X\" for 12mm extended hinge",null,"lock shield - (PO)lished or",48,"remarks? (marker for 2nd sheet)",null,null,null,null,null,null,null,"Picture",null,"akt. Fläche:",{"$f":"akt_CO*akt_CH/1000000","v":{"$error":"#VALUE!"}},null,null,null,null,"METAL \nFRAME","METAL \nFRAME","METAL \nFRAME","METAL \nFRAME","METAL \nFRAME","METAL \nFRAME","METAL \nFRAME","METAL \nFRAME"]
[null,null,null,null,null,null,6,"Type designation of door",15,"dimension of installation frames",22,"leaf surface on hinge side",30,"interval hinge to hinge to…",null,"(BR)ushed or CUSTOM ?",null,null,null,null,null,null,null,null,null,{"$f":"IF(OR(ISERROR(VLOOKUP(DOORLIST!K6,Z8:AA14,2,FALSE))=TRUE,DOORLIST!K6=\"\"),1,VLOOKUP(DOORLIST!K6,Z8:AA14,2,FALSE))","v":1},null,"Referenzfläche",1.68,"(ab 0,8mx2,1m)",null,null,null,"ABS \nEDGE","ABS \nEDGE",null,null,null,null,"ABS \nEDGE"]
{"$rows_left_out":121}